{"text_format":"1","workbook":"xlsx","n_sheets":8,"sheets":["Information Required","Help & Reference","Grade Code","Initiative","Drop Down Lists (DO NOT DELETE)","LISTS","Care Lists","Service Lists"],"not_rendered":{"charts":0,"images":1,"macros":1,"external_links":2,"defined_names":46,"comments":1,"pivot_tables":0},"unopened":[],"bounds":{"document_bytes":16777216,"sheet_cells":100000,"rows_first":2000,"rows_last":500,"rows_between":2000,"halvings":0,"cell_chars":16384,"cell_head_chars":4096},"cells_cut":0,"cells_raw":0,"read":"whole","date_system":"1900"}

{"sheet":"Information Required","index":0,"n_rows":116,"n_cols":24,"rows_kept":116,"cut":false,"hidden":false,"merged":[[2,3,2,5],[1,3,1,5]]}
[]
[null,null,null,"Primary Notification - Information Required"]
[null,null,null,"For help on completing this form please see tab 'Help & Reference'"]
[]
["Date: "]
["Requested By:"]
["Approved By:"]
[]
[null,"Service Area\n(Select from Dropdown)","HG/CHO/National Function (Select from Dropdown)","Division/Care Group\n(Select from dropdown)","Location\n(Select from dropdown)","Funding Stream \n(Select from Dropdown)","Funds Allocation\n(Select from dropdown)","Workstream\n(Select from dropdown)","Title of Initiative\n(Free text)","Grade Code\n(Select from dropdown)","Grade\n(Will automatically populate based on Grade Code entered)","Contract Type\n(Select from Dropdown)","WTE\n(Free text)","SWPI Log No              (SWP&I Office use only)","PN No                                     (SWP&I Office use only)","Change Request Date\n(Enter in format dd/mm/yyyy)","Change Request Type\n(Select from Dropdown)\n*If \"Other\" please provide details in Comments","New Location\n(Select from dropdown)","New Grade Code\n(Select from dropdown)","New Grade\n (Will automatically populate based on Grade Code entered)","New WTE\n(Free text)","New Initiative\n(Select from dropdown)","Change Approved By","Comments\n(Free text)"]
["Example","Community","CHO 5","Primary Care","Tipperary, South","NSP 2022","Recurring","CHNs","Sample",2828,{"$f":"IF(ISNA(VLOOKUP(J10,'Grade Code'!A:B,2,FALSE)),\"\",VLOOKUP(J10,'Grade Code'!A:B,2,FALSE))","v":"Public Health Nurse"},"Indefinite Duration",1,2123,"PN/Community/CHO5/123",null,null,null,null,{"$f":"IF(ISNA(VLOOKUP(S10,'Grade Code'!A:B,2,FALSE)),\"\",VLOOKUP(S10,'Grade Code'!A:B,2,FALSE))","v":""}]
[null,null,null,null,null,null,null,null,null,null,{"$f":"IF(ISNA(VLOOKUP(J11,'Grade Code'!A:B,2,FALSE)),\"\",VLOOKUP(J11,'Grade Code'!A:B,2,FALSE))","v":""},null,null,null,null,null,null,null,null,{"$f":"IF(ISNA(VLOOKUP(S11,'Grade Code'!A:B,2,FALSE)),\"\",VLOOKUP(S11,'Grade Code'!A:B,2,FALSE))","v":""}]
[null,null,null,null,null,null,null,null,null,null,{"$f":"IF(ISNA(VLOOKUP(J12,'Grade Code'!A:B,2,FALSE)),\"\",VLOOKUP(J12,'Grade Code'!A:B,2,FALSE))","v":""},null,null,null,null,null,null,null,null,{"$f":"IF(ISNA(VLOOKUP(S12,'Grade Code'!A:B,2,FALSE)),\"\",VLOOKUP(S12,'Grade Code'!A:B,2,FALSE))","v":""}]
[null,null,null,null,null,null,null,null,null,null,{"$f":"IF(ISNA(VLOOKUP(J13,'Grade Code'!A:B,2,FALSE)),\"\",VLOOKUP(J13,'Grade Code'!A:B,2,FALSE))","v":""},null,null,null,null,null,null,null,null,{"$f":"IF(ISNA(VLOOKUP(S13,'Grade Code'!A:B,2,FALSE)),\"\",VLOOKUP(S13,'Grade Code'!A:B,2,FALSE))","v":""}]
[null,null,null,null,null,null,null,null,null,null,{"$f":"IF(ISNA(VLOOKUP(J14,'Grade Code'!A:B,2,FALSE)),\"\",VLOOKUP(J14,'Grade Code'!A:B,2,FALSE))","v":""},null,null,null,null,null,null,null,null,{"$f":"IF(ISNA(VLOOKUP(S14,'Grade Code'!A:B,2,FALSE)),\"\",VLOOKUP(S14,'Grade Code'!A:B,2,FALSE))","v":""}]
[null,null,null,null,null,null,null,null,null,null,{"$f":"IF(ISNA(VLOOKUP(J15,'Grade Code'!A:B,2,FALSE)),\"\",VLOOKUP(J15,'Grade Code'!A:B,2,FALSE))","v":""},null,null,null,null,null,null,null,null,{"$f":"IF(ISNA(VLOOKUP(S15,'Grade Code'!A:B,2,FALSE)),\"\",VLOOKUP(S15,'Grade Code'!A:B,2,FALSE))","v":""}]
{"$rows_left_out":102}
{"sheet":"Help & Reference","index":1,"n_rows":27,"n_cols":1,"rows_kept":27,"cut":false,"hidden":false,"merged":[[1,0,1,7]]}
[]
["Primary Notification Template Reference and Help"]
[]
[]
[]
[]
[]
["Completion of New PN Request"]
["• Columns B:M must be completed in full for all Primary Notification applications (Excluding Management Admin Staff Category, Grade VIII and above)"]
["• Forms for Management Admin Staff Category, Grade VIII and above can be found here"]
["• Failure to provide the required details/appropriate approval will result in the application being returned to the service for clarification with resultant delay in issue of Primary Notification/ Log Numbers"]
["• Workstreams are linked to Funding Streams so please select Funding stream first to see what workstreams are allocated to it (Workstreams can be confirmed by the PMO office  - WinterNSPPMO@ie.gt.com)"]
["• When completing ‘Title of Initiative’ column please insert the wording used in the Master reporting document which was was provided by you when you submitted your WTE/KPI’s for WP 2021 or NSP 2022"]
["• Details relating to funding streams, funds allocation should be confirmed with the Chief Finance Officer/Head of Finance"]
["• For assistance on Grades/Grade Codes please consult the 'Grade Codes' tab"]
{"$rows_left_out":13}
{"sheet":"Grade Code","index":2,"n_rows":704,"n_cols":5,"rows_kept":704,"cut":false,"hidden":false,"merged":[]}
["Code","Grade","Staff Category","Staff Group","Grade Group"]
[8,"Interviewer (not in census)","Management & Administrative","Administrative/ Supervisory (V to VII)","Other exclusions"]
[102,"Director Special Care Unit, Deputy","Management & Administrative","Administrative/ Supervisory (V to VII)","Other Administrative"]
[213,"Librarian, Senior","Management & Administrative","Administrative/ Supervisory (V to VII)","Other Administrative"]
[337,"Special Care Unit Manager, Assistant","Management & Administrative","Administrative/ Supervisory (V to VII)","Middle Management (V-VII)"]
[345,"Work Placement (Management Admin)","Management & Administrative","Administrative/ Supervisory (V to VII)","Other Administrative"]
[396,"Telephonist, Supervisor","Management & Administrative","Clerical (III & IV)","General Administrative (III & IV)"]
[404,"Technical Services Manager","Management & Administrative","Administrative/ Supervisory (V to VII)","Other Administrative"]
[558,"Grade IV","Management & Administrative","Clerical (III & IV)","General Administrative (III & IV)"]
[566,"Grade V","Management & Administrative","Administrative/ Supervisory (V to VII)","Middle Management (V-VII)"]
[574,"Grade VI","Management & Administrative","Administrative/ Supervisory (V to VII)","Middle Management (V-VII)"]
[582,"Grade VII","Management & Administrative","Administrative/ Supervisory (V to VII)","Middle Management (V-VII)"]
[609,"Clerical  Officer","Management & Administrative","Clerical (III & IV)","General Administrative (III & IV)"]
[728,"Telephonist, Night","Management & Administrative","Clerical (III & IV)","General Administrative (III & IV)"]
[739,"Telephonist, Supervisor, Assistant","Management & Administrative","Clerical (III & IV)","General Administrative (III & IV)"]
{"$rows_left_out":690}
{"sheet":"Initiative","index":3,"n_rows":338,"n_cols":10,"rows_kept":338,"cut":false,"hidden":true,"merged":[]}
["Ref","Initiative","Service","Workstream Mapped",null,"2021 Our Team","2021 Liz Team","Amalgamated List","2022 LOD","Winter Plan 2021/2022"]
[2.1,"PPE","NAT","H&WB Corporate & National Services",null,"Acute Alt. Pathways","Access to Care Fund","Access to Care Fund","Acute Capacity","Acute Capacity"]
[2.1,"PPE","NAT","H&WB Corporate & National Services",null,"Access to Care","Access to Care Fund - CHI","Accommodation - Vulnerable ","Community Capacity","Community Capacity"]
[2.1,"PPE","NAT","H&WB Corporate & National Services",null,"Acute Beds","Access to Care Fund - DMHG","Acute Beds","Integrated Pathways","Integrated Pathways"]
[2.2000000000000002,"Test and Trace","NAT","H&WB Corporate & National Services",null,"Acute Restart","Access to Care Fund - IEHG","Acute Restart","Public Health","Public Health"]
[2.2000000000000002,"Test and Trace","NAT","H&WB Corporate & National Services",null,"AMRIC","Access to Care Fund - Private Hospitals","Acute Vacancy (Replacement)","eHealth"]
[2.2000000000000002,"Test and Trace","NAT","H&WB Corporate & National Services",null,"Baseline & Capacity","Access to Care Fund - RCSI","Alternative Pathways"]
[2.2000000000000002,"Test and Trace","NAT","H&WB Corporate & National Services",null,"Bowel Screen Expansion","Access to Care Fund - SAOLTA","Alternative Placements from Nursing Homes"]
[2.2000000000000002,"Test and Trace","NAT","H&WB Corporate & National Services",null,"Breastcheck","Access to Care Fund - SSWHG","Alternative Pre-Hospital Pathway"]
[2.2000000000000002,"Test and Trace","NAT","H&WB Corporate & National Services",null,"Cancer Services","Access to Care Fund - ULHG","Antimicrobial Resistance in Infection Control (AMRIC)"]
[2.2000000000000002,"Test and Trace","NAT","H&WB Corporate & National Services",null,"CHNs","Accommodation - Vulnerable ","Brexit"]
[2.2000000000000002,"Test and Trace","NAT","H&WB Corporate & National Services",null,"CIT","Acute Beds (1,146)","Cancer Restart"]
[2.2000000000000002,"Test and Trace","NAT","H&WB Corporate & National Services",null,"Clinical Governance","Acute Hospital Service Restart - Children's Health Ireland (CHI)","Cancer Screening"]
[2.2000000000000002,"Test and Trace","NAT","H&WB Corporate & National Services",null,"Colposcopy Services","Acute Hospital Service Restart - Dublin Midlands Hospital Group","Cancer Strategy"]
[2.2000000000000002,"Test and Trace","NAT","H&WB Corporate & National Services",null,"Community Paramedic","Acute Hospital Service Restart - Dublin Midlands Hospitals Group","Care Redesign"]
{"$rows_left_out":324}
{"sheet":"Drop Down Lists (DO NOT DELETE)","index":4,"n_rows":722,"n_cols":49,"rows_kept":722,"cut":false,"hidden":true,"merged":[]}
["Code","Grade",null,"CHO/HG","Column1","Funding Stream",null,"Initiative",null,"Service Area",null,"Division",null,"Recurring",null,"Contract Type","CHO/HG","Location","Location","Location","Location","Location","Location",null,"Children's Health Ireland","CHO 1","CHO 2","CHO 3","CHO 4","CHO 5","CHO 6","CHO 7","CHO 8","CHO 9","Corporate","Dublin Midlands Hospital Group","Health & Wellbeing","Ireland East Hospital Group","National Ambulance Service","other Acute Services","other Community Services","RCSI Hospitals Group","Saolta University Hospital Care","South/South West Hospital Group","University of Limerick Hospital Group",null,null,null,"CHO/HG"]
["076Y","Accountant",null,"Children's Health Ireland","CHI","NSP 2020",null,"Acute Alt. Pathways",null,"Acute Services",null,"Acute Services",null,"Recurring",null,"Permanent","Children's Health Ireland","Ambulance Services",null,null,null,null,null,null,"CHI at Connolly","Cavan/ Monaghan","Galway","Clare","Cork North","Carlow/ Kilkenny","Dublin South-East","Dublin South City","Laois /Offaly","Dublin North","Cancer Control Service","Coombe Women & Infants University","Health & Wellbeing, National","Cappagh National Orthopaedic","Ambulance Services","Other","Dublin South-West","Beaumont","Galway University","Bantry General","Croom Orthopaedic",null,null,null,"Children's Health Ireland"]
["099X","Administration Unclassified",null,"CHO 1",null,"NSP 2021",null,"Access to Care",null,"Community Services",null,"CHO Operations",null,"Once Off Allocation",null,"Indefinite Duration","Children's Health Ireland","Bantry General",null,null,null,null,null,null,"CHI at Crumlin","Donegal","Mayo","Limerick","Cork North Lee","Tipperary, South","Dun Laoghaire","Dublin South-West","Longford/ Westmeath","Dublin North Central","CEO's Office","Hospital Group HQ","Health Intelligence","Hospital Group HQ",null,null,"Other","Cavan General","Hospital Group HQ","Cork University","Ennis"]
[2535,"Advanced Midwife Practitioner",null,"CHO 2",null,"NSP 2022",null,"Acute Beds",null,"HWB, Corporate & National",null,"Community Health & Wellbeing",null,null,null,"Specified Purpose","Children's Health Ireland","Beaumont",null,null,null,null,null,null,"CHI at Tallaght","Sligo/ Leitrim","Roscommon","Tipperary, North/ Limerick, East","Cork South Lee","Waterford","Wicklow","Dublin West","Louth","Dublin North-West","Clinical Design & Innovation","MRH Portlaoise","Health Promotion & Improvement","IEHG Bank",null,null,null,"Connolly","Letterkenny University","Hospital Group HQ","Hospital Group HQ"]
[2536,"Advanced Midwife Practitioner, Candidate",null,"CHO 3",null,"Winter Plan 2020/2021",null,"Acute Restart",null,null,null,"Corporate",null,null,null,"Fixed Term","Children's Health Ireland","Cancer Control Service",null,null,null,null,null,null,"CHI at Temple Street","Other","Other",null,"Cork West","Wexford","Other","Kildare/ West Wicklow","Meath","Other","Communications","MRH Tullamore","Planning & Performance (HWB)","Mater Misericordiae University",null,null,null,"Hospital Group HQ","Mayo University","Lourdes Orthopaedic Kilcreene","Nenagh"]
[2277,"Advanced Nurse Practitioner, Candidate (Children's)",null,"CHO 4",null,"Winter Plan 2021/2022",null,"AMRIC",null,null,null,"Disabilities",null,null,null,null,"Children's Health Ireland","Cappagh National Orthopaedic",null,null,null,null,null,null,"CHI Corporate",null,null,null,"Kerry",null,null,"Other","Other",null,"Compliance","Naas General","Public Health","MRH Mullingar",null,null,null,"Louth County","Portiuncula University","Mallow General","St. John's Limerick"]
[2276,"Advanced Nurse Practitioner, Candidate (Community /Primary Care)",null,"CHO 5",null,null,null,"Baseline & Capacity",null,null,null,"Health & Wellbeing",null,null,null,null,"Children's Health Ireland","Carlow/ Kilkenny",null,null,null,null,null,null,"CHI Programme",null,null,null,"Other",null,null,null,null,null,"Emergency Management","St. James's","Public Laboratory","National Maternity",null,null,null,"Monaghan","Roscommon University","Mercy University","UH Limerick"]
[2272,"Advanced Nurse Practitioner, Candidate (General)",null,"CHO 6",null,null,null,"Bowel Screen Expansion",null,null,null,"Mental Health",null,null,null,null,"Children's Health Ireland","Cavan General",null,null,null,null,null,null,null,null,null,null,null,null,null,null,null,null,"Environmental Health","St. Luke's Rathgar",null,"National Rehabilitation",null,null,null,"Our Lady of Lourdes","Sligo University","South Infirmary Victoria University","UMH Limerick"]
[2278,"Advanced Nurse Practitioner, Candidate (Intellectual Disability)",null,"CHO 7",null,null,null,"Breastcheck",null,null,null,"National Ambulance Services",null,null,null,null,"Children's Health Ireland","Cavan/ Monaghan",null,null,null,null,null,null,null,null,null,null,null,null,null,null,null,null,"Finance","Tallaght University",null,"Our Lady's Navan",null,null,null,"Rotunda",null,"South Tipperary General"]
[2274,"Advanced Nurse Practitioner, Candidate (Mental Health)",null,"CHO 8",null,null,null,"Cancer Services",null,null,null,"Older Persons",null,null,null,null,"Children's Health Ireland","CEO's Office",null,null,null,null,null,null,null,null,null,null,null,null,null,null,null,null,"Human Resources",null,null,"Royal Victoria Eye & Ear",null,null,null,null,null,"UH Kerry"]
[2270,"Advanced Nurse Practitioner (Children's)",null,"CHO 9",null,null,null,"CHNs",null,null,null,"Primary Care",null,null,null,null,"Children's Health Ireland","CHI at Connolly",null,null,null,null,null,null,null,null,null,null,null,null,null,null,null,null,"ICT",null,null,"St Luke's General Kilkenny",null,null,null,null,null,"UH Waterford"]
[2269,"Advanced Nurse Practitioner (Community /Primary Care)",null,"Corporate",null,null,null,"CIT",null,null,null,null,null,null,null,null,"Children's Health Ireland","CHI at Crumlin",null,null,null,null,null,null,null,null,null,null,null,null,null,null,null,null,"Internal Audit",null,null,"St. Columcille's"]
[2267,"Advanced Nurse Practitioner (General)",null,"Dublin Midlands Hospital Group",null,null,null,"Clinical Governance",null,null,null,null,null,null,null,null,"Children's Health Ireland","CHI at Tallaght",null,null,null,null,null,null,null,null,null,null,null,null,null,null,null,null,"Legal Services",null,null,"St. Michael's"]
[2271,"Advanced Nurse Practitioner (Intellectual Disability)",null,"Health & Wellbeing",null,null,null,"Colposcopy Services",null,null,null,null,null,null,null,null,"Children's Health Ireland","CHI at Temple Street",null,null,null,null,null,null,null,null,null,null,null,null,null,null,null,null,"National Screening Service",null,null,"St. Vincent's University"]
[2268,"Advanced Nurse Practitioner (Mental Health)",null,"Ireland East Hospital Group",null,null,null,"Community Paramedic",null,null,null,null,null,null,null,null,"Children's Health Ireland","CHI Corporate",null,null,null,null,null,null,null,null,null,null,null,null,null,null,null,null,"NDTP",null,null,"Wexford General"]
{"$rows_left_out":708}
{"sheet":"LISTS","index":5,"n_rows":116,"n_cols":30,"rows_kept":116,"cut":false,"hidden":true,"merged":[]}
["CHOHG","CHOHGLOOKUP","Location","Childrens Health Ireland","CHO 1","CHO 2","CHO 3","CHO 4","CHO 5","CHO 6","CHO 7","CHO 8","CHO 9","Corporate","Dublin Midlands Hospital Group","Health & Wellbeing","Ireland East Hospital Group","National Ambulance Service","other Acute Services","other Community Services","RCSI Hospitals Group","Saolta University Hospital Care","South/South West Hospital Group","University of Limerick Hospital Group",null,null,null,"CHO/HG",null,"Change Requests"]
["Children's Health Ireland","CHI","Ambulance Services","CHI at Connolly","Cavan/ Monaghan","Galway","Clare","Cork North","Carlow/ Kilkenny","Dublin South-East","Dublin South City","Laois /Offaly","Dublin North","Cancer Control Service","Coombe Women & Infants University","Health & Wellbeing, National","Cappagh National Orthopaedic","Ambulance Services","Other","Dublin South-West","Beaumont","Galway University","Bantry General","Croom Orthopaedic",null,null,null,"Children's Health Ireland",null,"Location Change"]
["CHO 1","CHO1","Bantry General","CHI at Crumlin","Donegal","Mayo","Limerick","Cork North Lee","Tipperary, South","Dun Laoghaire","Dublin South-West","Longford/ Westmeath","Dublin North Central","CEO's Office","Hospital Group HQ","Health Intelligence","Hospital Group HQ",null,null,"Other","Cavan General","Hospital Group HQ","Cork University","Ennis",null,null,null,null,null,"Location & WTE Change"]
["CHO 2","CHO2","Beaumont","CHI at Tallaght","Sligo/ Leitrim","Roscommon","Tipperary, North/ Limerick, East","Cork South Lee","Waterford","Wicklow","Dublin West","Louth","Dublin North-West","Clinical Design & Innovation","MRH Portlaoise","Health Promotion & Improvement","IEHG Bank",null,null,null,"Connolly","Letterkenny University","Hospital Group HQ","Hospital Group HQ",null,null,null,null,null,"Location & Grade Change"]
["CHO 3","CHO3","Cancer Control Service","CHI at Temple Street","Other","Other",null,"Cork West","Wexford","Other","Kildare/ West Wicklow","Meath","Other","Communications","MRH Tullamore","Planning & Performance (HWB)","Mater Misericordiae University",null,null,null,"Hospital Group HQ","Mayo University","Lourdes Orthopaedic Kilcreene","Nenagh",null,null,null,null,null,"Location, WTE & Grade Change"]
["CHO 4","CHO4","Cappagh National Orthopaedic","CHI Corporate",null,null,null,"Kerry",null,null,"Other","Other",null,"Compliance","Naas General","Public Health","MRH Mullingar",null,null,null,"Louth County","Portiuncula University","Mallow General","St. John's Limerick",null,null,null,null,null,"WTE Change"]
["CHO 5","CHO5","Carlow/ Kilkenny","CHI Programme",null,null,null,"Other",null,null,null,null,null,"Emergency Management","St. James's","Public Laboratory","National Maternity",null,null,null,"Monaghan","Roscommon University","Mercy University","UH Limerick",null,null,null,null,null,"WTE & Grade Change"]
["CHO 6","CHO6","Cavan General",null,null,null,null,null,null,null,null,null,null,"Environmental Health","St. Luke's Rathgar",null,"National Rehabilitation",null,null,null,"Our Lady of Lourdes","Sligo University","South Infirmary Victoria University","UMH Limerick",null,null,null,null,null,"Grade Change"]
["CHO 7","CHO7","Cavan/ Monaghan",null,null,null,null,null,null,null,null,null,null,"Finance","Tallaght University",null,"Our Lady's Navan",null,null,null,"Rotunda",null,"South Tipperary General",null,null,null,null,null,null,"Initiative Change"]
["CHO 8","CHO8","CEO's Office",null,null,null,null,null,null,null,null,null,null,"Human Resources",null,null,"Royal Victoria Eye & Ear",null,null,null,null,null,"UH Kerry",null,null,null,null,null,null,"Other"]
["CHO 9","CHO9","CHI at Connolly",null,null,null,null,null,null,null,null,null,null,"ICT",null,null,"St Luke's General Kilkenny",null,null,null,null,null,"UH Waterford"]
["Corporate","Corporate","CHI at Crumlin",null,null,null,null,null,null,null,null,null,null,"Internal Audit",null,null,"St. Columcille's"]
["Dublin Midlands Hospital Group","DublinMidlands","CHI at Tallaght",null,null,null,null,null,null,null,null,null,null,"Legal Services",null,null,"St. Michael's",null,null,null,null,null,null,null,null,null,null,null,null,"WTE Change"]
["Health & Wellbeing","Health","CHI at Temple Street",null,null,null,null,null,null,null,null,null,null,"National Screening Service",null,null,"St. Vincent's University",null,null,null,null,null,null,null,null,null,null,null,null,"Grade Change"]
["Ireland East Hospital Group","IrelandEast","CHI Corporate",null,null,null,null,null,null,null,null,null,null,"NDTP",null,null,"Wexford General"]
{"$rows_left_out":102}
{"sheet":"Care Lists","index":6,"n_rows":22,"n_cols":15,"rows_kept":22,"cut":false,"hidden":true,"merged":[]}
["CHOHG","CHOHGLOOKUP",null,null,"Division",null,"Acute",null,"CHO",null,"Corporate",null,"Amb",null,"Hea"]
["Children's Health Ireland","AcuteCare",null,null,"Acute Services",null,"Acute Services",null,"CHO Operations",null,"Corporate",null,"National Ambulance Services",null,"Health & Wellbeing"]
["CHO 1","CHOCare",null,null,"CHO Operations",null,null,null,"Community Health & Wellbeing"]
["CHO 2","CHOCare",null,null,"Community Health & Wellbeing",null,null,null,"Disabilities"]
["CHO 3","CHOCare",null,null,"Corporate",null,null,null,"Mental Health"]
["CHO 4","CHOCare",null,null,"Disabilities",null,null,null,"Older Persons"]
["CHO 5","CHOCare",null,null,"Health & Wellbeing",null,null,null,"Primary Care"]
["CHO 6","CHOCare",null,null,"Mental Health"]
["CHO 7","CHOCare",null,null,"National Ambulance Services"]
["CHO 8","CHOCare",null,null,"Older Persons"]
["CHO 9","CHOCare",null,null,"Primary Care"]
["Corporate","CorporateCare"]
["Dublin Midlands Hospital Group","AcuteCare"]
["Health & Wellbeing","Hea"]
["Ireland East Hospital Group","AcuteCare"]
{"$rows_left_out":8}
{"sheet":"Service Lists","index":7,"n_rows":11,"n_cols":13,"rows_kept":11,"cut":false,"hidden":true,"merged":[]}
["Servies","Matd",null,"Communi",null,"Acut",null,"Cp"]
["Acute Services","As",null,"CHO 1",null,"Children's Health Ireland",null,"Corporate",null,null,"Column1",null,"Column1"]
["Community","Cm",null,"CHO 2",null,"Dublin Midlands Hospital Group",null,"Health & Wellbeing",null,null,1,null,4]
["HWB, Corporate & National","Hw",null,"CHO 3",null,"Ireland East Hospital Group",null,null,null,null,2,null,5]
[null,null,null,"CHO 4",null,"National Ambulance Service",null,null,null,null,3,null,6]
[null,null,null,"CHO 5",null,"RCSI Hospitals Group"]
[null,null,null,"CHO 6",null,"Saolta University Hospital Care"]
[null,null,null,"CHO 7",null,"South/South West Hospital Group"]
[null,null,null,"CHO 8",null,"University of Limerick Hospital Group"]
[null,null,null,"CHO 9",null,"other Acute Services"]
[null,null,null,"other Community Services"]